{"text_format":"1","workbook":"xlsx","n_sheets":4,"sheets":["Licentieblad","Mooi Werk Excel","Samenvatting","Dropdown"],"not_rendered":{"charts":7,"images":9,"macros":1,"external_links":1,"defined_names":17,"comments":0,"pivot_tables":0},"unopened":[],"bounds":{"document_bytes":16777216,"sheet_cells":100000,"rows_first":2000,"rows_last":500,"rows_between":2000,"halvings":0,"cell_chars":16384,"cell_head_chars":4096},"cells_cut":0,"cells_raw":0,"read":"whole","date_system":"1900"}

{"sheet":"Licentieblad","index":0,"n_rows":22,"n_cols":7,"rows_kept":22,"cut":false,"hidden":false,"merged":[]}
[]
[null,null,null,null,null,null,"WELKOM!"]
[null,null,null,null,null,null," Lees voor gebruik eerst deze bijsluiter:"]
[]
[null,null,null,null,null,null,"TECHNISCHE DETAILS"]
[null,null,null,null,null,null,"Om ‘Mooi Werk Excel’ de eerste keer te laten werken, klik (éénmalig) op de knop ‘Enable content’, ‘Bewerken inschakelen’, en/of ‘Inhoud inschakelen’."]
[null,null,null,null,null,null,"Dit programma werkt alleen in Excel 2016 (of meer recente ‘Office’ versies) en alleen in Windows. Apple ondersteunt de grafieken helaas niet."]
[null,null,null,null,null,null,"Gebruik op een normale laptop op desktop is aan te bevelen. Het is niet getest op mobiele versies van Excel op tablet of smartphone. "]
[null,null,null,null,null,null,"Je kunt je invoer niet opslaan in het Excel werkblad. Als je Excel afsluit ben je alles kwijt. Je kunt alles wel via PDF-print bewaren of aan jezelf mailen. "]
[]
[null,null,null,null,null,null,"PERSOONLIJKE DEMOVERSIE"]
[null,null,null,null,null,null,"Mooi Werk Excel is nog in ontwikkeling. Aan de werking kunnen geen rechten worden ontleend."]
[null,null,null,null,null,null,"Deze demoversie stellen we alvast 25 keer open voor persoonlijke en/of niet-commerciële doeleinden."]
[null,null,null,null,null,null,"Werkt het programma niet meer, dan heeft het deze limiet bereikt. Mail ons dan gerust voor nieuwe toegang."]
[]
[]
[null,null,null,null,null,null,{"$f":"IF(Dropdown!M2<25, \"Neem bij vragen of feedback contact op met: ‘info@debaaningenieurs.nl’.\", \"Neem voor ‘nieuwe’ toegang tot ‘Mooi Werk Excel’ contact op met: ‘info@debaaningenieurs.nl’.\")","v":"Neem bij vragen of feedback contact op met: ‘info@debaaningenieurs.nl’."}]
[null,null,null,null,null,null,{"$f":"IF(Dropdown!M2<25, \"Deze demoversie van ‘Mooi Werk Excel’ kan nog \" & MAX(0, 25-Dropdown!M2) & \" keer worden gebruikt.\", \"Voor niet-commercieel eigen gebruik krijg je zo spoedig mogelijk ‘opnieuw’ toegang.\")","v":"Deze demoversie van ‘Mooi Werk Excel’ kan nog 25 keer worden gebruikt."}]
[]
[]
{"$rows_left_out":3}
{"sheet":"Mooi Werk Excel","index":1,"n_rows":405,"n_cols":51,"rows_kept":405,"cut":false,"hidden":true,"merged":[[12,5,12,14],[369,2,369,6],[367,8,368,15],[369,8,369,15],[385,17,385,23],[380,17,383,23],[379,17,379,23],[367,17,368,23],[370,10,370,14],[369,17,369,23],[370,19,370,23],[371,17,371,23],[372,17,372,23],[380,8,383,15],[376,17,376,23],[375,17,375,23],[373,8,373,15],[373,17,373,23],[404,10,404,24],[375,8,375,15],[392,2,395,6],[391,17,391,23],[392,17,395,23],[391,2,391,6],[386,2,389,6],[392,8,395,15],[386,17,389,23],[391,8,391,15],[386,8,389,15],[376,8,376,15],[182,2,182,4],[228,2,228,4],[274,2,274,4],[379,8,379,15],[385,8,385,15],[385,2,385,6],[380,2,383,6],[379,2,379,6],[367,2,368,6],[371,2,371,6],[372,2,372,6],[373,2,373,6],[375,2,375,6],[376,2,376,6],[371,8,371,15],[372,8,372,15]]}
[]
[null,"Met Mooi Werk Excel kun je zelf een analyse maken van je eigen werk en taakfit. Je volgt 8 stappen naar Mooier Werk."]
[null,"Onderstaand werkblad is ingevuld voor de casus ‘Meike’, zoals beschreven in hoofdstuk 8 van het boek Mooier Werk. "]
[null,"Mooi Werk Excel toont je in 30-60 minuten hoe mooi je werk is. Waar past het goed? Waar minder? Wat kan beter?"]
[null,"De alvast ingevulde velden die je hieronder zult aantreffen volgen dus het taakprofiel van:"]
[]
[]
[null,null,"Meike (Redacteur bij een tijdschrift)"]
[]
[null,"Maak van Meike’s taakprofiel je persoonlijk profiel door de tekst en getallen in de velden aan te passen aan jouw werk."]
[null,"Tip: neem hoofdstuk 8 van het boek Mooier Werk erbij, dan snap je beter wat je moet doen en wat het betekent."]
[]
[null,null,null,null,"Heb je geen boek? ","Klik hier om te bestellen via Uitgeverij Boom."]
[]
[]
[]
[]
[]
[]
[]
{"$rows_left_out":386}
{"sheet":"Samenvatting","index":2,"n_rows":29,"n_cols":28,"rows_kept":29,"cut":false,"hidden":true,"merged":[[6,1,6,6],[16,8,16,10],[6,8,6,14],[17,8,17,10],[18,8,18,10],[4,8,4,10],[11,8,11,10],[12,8,12,10],[13,8,13,10],[14,8,14,10],[9,8,9,10],[10,8,10,10],[8,8,8,10],[7,27,8,27],[6,16,6,20],[6,22,6,25],[19,8,19,10],[20,8,20,10],[15,8,15,10]]}
[]
[]
[null,"TOTAALBEELD"]
[null,"SAMENVATTING VAN WAT JE IN ACHT STAPPEN BIJ ELKE TAAK HEBT INGEVULD"]
[]
[]
[null,"WELKE TAKEN DOE JE EN HOEVEEL?",null,null,null,null,null,null,"WAT ZIJN DE KENMERKEN\nVAN DEZE TAKEN?",null,null,null,null,null,null,null,"HOE GOED PASSEN DEZE TAKEN BIJ JE?",null,null,null,null,null,"WAT WIL EN KUN JE\nOVER 2 JAAR NOG?",null,null,null,null,"WAARAAN WIL JE\nSLEUTELEN?"]
[null,null,null,null,null,null,null,null,null,null,null,null,null,null,null,null,null,null,null,null,null,null,null,null,null,null,null,"Sleutelwens- en richting?"]
[null,"Afzonderlijke taken",null,"% Taaktijd",null,"Uur p/week",null,null,"Kerntaak?",null,null,null,"Begin/Later?",null,"Krimp/Groei?",null,"Taakfit","Geeft energie? (+)",null,"Kost energie? (−)",null,null,"(Minder) willen?",null,"(Slechter) kunnen?"]
[null,{"$f":"IF('Mooi Werk Excel'!E323<>\"\", 'Mooi Werk Excel'!E323, \"\")","v":"Schrijfwerk"},null,{"$f":"IF('Mooi Werk Excel'!I323<>\"\", ROUND('Mooi Werk Excel'!I323, 0), \"\")","v":25},{"$f":"IF(D10<>\"\", \"%\", \"\")","v":"%"},{"$f":"IF('Mooi Werk Excel'!K323<>\"\", ROUND('Mooi Werk Excel'!K323, 1), \"\")","v":10},{"$f":"IF(F10<>\"\", \"uur\", \"\")","v":"uur"},null,{"$f":"IF(B10<>\"\", INDEX('Mooi Werk Excel'!$E$139:$E$150, MATCH(B10, 'Mooi Werk Excel'!$G$139:$G$150, 0)), \"\")","v":"Kerntaak"},null,null,null,{"$f":"IF(B10<>\"\", INDEX('Mooi Werk Excel'!$C$185:$C$196, MATCH(B10, 'Mooi Werk Excel'!$G$185:$G$196, 0)), \"\")","v":"Vanaf begin"},null,{"$f":"IF(B10<>\"\", INDEX('Mooi Werk Excel'!$E$185:$E$196, MATCH(B10, 'Mooi Werk Excel'!$G$185:$G$196, 0)), \"\")","v":"krimptaak"},null,{"$f":"IF(B10<>\"\", INDEX('Mooi Werk Excel'!$AU$231:$AU$242, MATCH(B10, 'Mooi Werk Excel'!$G$231:$G$242, 0)), \"\")","v":"2-Faced"},{"$f":"IF(B10<>\"\", INDEX('Mooi Werk Excel'!$C$231:$C$242, MATCH(B10, 'Mooi Werk Excel'!$G$231:$G$242, 0)), \"\")","v":"Geeft veel energie"},null,{"$f":"IF(B10<>\"\", INDEX('Mooi Werk Excel'!$E$231:$E$242, MATCH(B10, 'Mooi Werk Excel'!$G$231:$G$242, 0)), \"\")","v":"Kost veel energie"},null,null,{"$f":"IF(B10<>\"\", INDEX('Mooi Werk Excel'!$C$277:$C$288, MATCH(B10, 'Mooi Werk Excel'!$G$277:$G$288, 0)), \"\")","v":"Wil ik nog (+)"},null,{"$f":"IF(B10<>\"\", INDEX('Mooi Werk Excel'!$E$277:$E$288, MATCH(B10, 'Mooi Werk Excel'!$G$277:$G$288, 0)), \"\")","v":"Kan ik slechter (−)"},null,null,{"$f":"IF(B10<>\"\", IF('Mooi Werk Excel'!G323<>\"\", INDEX('Mooi Werk Excel'!$G$323:$G$334, MATCH(B10, 'Mooi Werk Excel'!$E$323:$E$334, 0)), \"\"), \"\")","v":"Anders"}]
[null,{"$f":"IF('Mooi Werk Excel'!E324<>\"\", 'Mooi Werk Excel'!E324, \"\")","v":"Social Media"},null,{"$f":"IF('Mooi Werk Excel'!I324<>\"\", ROUND('Mooi Werk Excel'!I324, 0), \"\")","v":10},{"$f":"IF(D11<>\"\", \"%\", \"\")","v":"%"},{"$f":"IF('Mooi Werk Excel'!K324<>\"\", ROUND('Mooi Werk Excel'!K324, 1), \"\")","v":4},{"$f":"IF(F11<>\"\", \"uur\", \"\")","v":"uur"},null,{"$f":"IF(B11<>\"\", INDEX('Mooi Werk Excel'!$E$139:$E$150, MATCH(B11, 'Mooi Werk Excel'!$G$139:$G$150, 0)), \"\")","v":"Extra taak"},null,null,null,{"$f":"IF(B11<>\"\", INDEX('Mooi Werk Excel'!$C$185:$C$196, MATCH(B11, 'Mooi Werk Excel'!$G$185:$G$196, 0)), \"\")","v":"Later erbij"},null,{"$f":"IF(B11<>\"\", INDEX('Mooi Werk Excel'!$E$185:$E$196, MATCH(B11, 'Mooi Werk Excel'!$G$185:$G$196, 0)), \"\")","v":"GROEITAAK"},null,{"$f":"IF(B11<>\"\", INDEX('Mooi Werk Excel'!$AU$231:$AU$242, MATCH(B11, 'Mooi Werk Excel'!$G$231:$G$242, 0)), \"\")","v":"Mooi"},{"$f":"IF(B11<>\"\", INDEX('Mooi Werk Excel'!$C$231:$C$242, MATCH(B11, 'Mooi Werk Excel'!$G$231:$G$242, 0)), \"\")","v":"Geeft veel energie"},null,{"$f":"IF(B11<>\"\", INDEX('Mooi Werk Excel'!$E$231:$E$242, MATCH(B11, 'Mooi Werk Excel'!$G$231:$G$242, 0)), \"\")","v":"Kost weinig energie"},null,null,{"$f":"IF(B11<>\"\", INDEX('Mooi Werk Excel'!$C$277:$C$288, MATCH(B11, 'Mooi Werk Excel'!$G$277:$G$288, 0)), \"\")","v":"Wil ik nog (+)"},null,{"$f":"IF(B11<>\"\", INDEX('Mooi Werk Excel'!$E$277:$E$288, MATCH(B11, 'Mooi Werk Excel'!$G$277:$G$288, 0)), \"\")","v":"Kan ik goed (+)"},null,null,{"$f":"IF(B11<>\"\", IF('Mooi Werk Excel'!G324<>\"\", INDEX('Mooi Werk Excel'!$G$323:$G$334, MATCH(B11, 'Mooi Werk Excel'!$E$323:$E$334, 0)), \"\"), \"\")","v":"Groter"}]
[null,{"$f":"IF('Mooi Werk Excel'!E325<>\"\", 'Mooi Werk Excel'!E325, \"\")","v":"Interviews"},null,{"$f":"IF('Mooi Werk Excel'!I325<>\"\", ROUND('Mooi Werk Excel'!I325, 0), \"\")","v":5},"%",{"$f":"IF('Mooi Werk Excel'!K325<>\"\", ROUND('Mooi Werk Excel'!K325, 1), \"\")","v":2},"uur",null,{"$f":"IF(B12<>\"\", INDEX('Mooi Werk Excel'!$E$139:$E$150, MATCH(B12, 'Mooi Werk Excel'!$G$139:$G$150, 0)), \"\")","v":"Kerntaak"},null,null,null,{"$f":"IF(B12<>\"\", INDEX('Mooi Werk Excel'!$C$185:$C$196, MATCH(B12, 'Mooi Werk Excel'!$G$185:$G$196, 0)), \"\")","v":"Vanaf begin"},null,{"$f":"IF(B12<>\"\", INDEX('Mooi Werk Excel'!$E$185:$E$196, MATCH(B12, 'Mooi Werk Excel'!$G$185:$G$196, 0)), \"\")","v":"GROEITAAK"},null,{"$f":"IF(B12<>\"\", INDEX('Mooi Werk Excel'!$AU$231:$AU$242, MATCH(B12, 'Mooi Werk Excel'!$G$231:$G$242, 0)), \"\")","v":"Risico"},{"$f":"IF(B12<>\"\", INDEX('Mooi Werk Excel'!$C$231:$C$242, MATCH(B12, 'Mooi Werk Excel'!$G$231:$G$242, 0)), \"\")","v":"Geeft weinig energie"},null,{"$f":"IF(B12<>\"\", INDEX('Mooi Werk Excel'!$E$231:$E$242, MATCH(B12, 'Mooi Werk Excel'!$G$231:$G$242, 0)), \"\")","v":"Kost veel energie"},null,null,{"$f":"IF(B12<>\"\", INDEX('Mooi Werk Excel'!$C$277:$C$288, MATCH(B12, 'Mooi Werk Excel'!$G$277:$G$288, 0)), \"\")","v":"Wil ik minder (−)"},null,{"$f":"IF(B12<>\"\", INDEX('Mooi Werk Excel'!$E$277:$E$288, MATCH(B12, 'Mooi Werk Excel'!$G$277:$G$288, 0)), \"\")","v":"Kan ik goed (+)"},null,null,{"$f":"IF(B12<>\"\", IF('Mooi Werk Excel'!G325<>\"\", INDEX('Mooi Werk Excel'!$G$323:$G$334, MATCH(B12, 'Mooi Werk Excel'!$E$323:$E$334, 0)), \"\"), \"\")","v":"Kleiner"}]
[null,{"$f":"IF('Mooi Werk Excel'!E326<>\"\", 'Mooi Werk Excel'!E326, \"\")","v":"Vergaderen"},null,{"$f":"IF('Mooi Werk Excel'!I326<>\"\", ROUND('Mooi Werk Excel'!I326, 0), \"\")","v":15},"%",{"$f":"IF('Mooi Werk Excel'!K326<>\"\", ROUND('Mooi Werk Excel'!K326, 1), \"\")","v":6},"uur",null,{"$f":"IF(B13<>\"\", INDEX('Mooi Werk Excel'!$E$139:$E$150, MATCH(B13, 'Mooi Werk Excel'!$G$139:$G$150, 0)), \"\")","v":"Niet-Kerntaak"},null,null,null,{"$f":"IF(B13<>\"\", INDEX('Mooi Werk Excel'!$C$185:$C$196, MATCH(B13, 'Mooi Werk Excel'!$G$185:$G$196, 0)), \"\")","v":"Vanaf begin"},null,{"$f":"IF(B13<>\"\", INDEX('Mooi Werk Excel'!$E$185:$E$196, MATCH(B13, 'Mooi Werk Excel'!$G$185:$G$196, 0)), \"\")","v":"GROEITAAK"},null,{"$f":"IF(B13<>\"\", INDEX('Mooi Werk Excel'!$AU$231:$AU$242, MATCH(B13, 'Mooi Werk Excel'!$G$231:$G$242, 0)), \"\")","v":"Risico"},{"$f":"IF(B13<>\"\", INDEX('Mooi Werk Excel'!$C$231:$C$242, MATCH(B13, 'Mooi Werk Excel'!$G$231:$G$242, 0)), \"\")","v":"Geeft weinig energie"},null,{"$f":"IF(B13<>\"\", INDEX('Mooi Werk Excel'!$E$231:$E$242, MATCH(B13, 'Mooi Werk Excel'!$G$231:$G$242, 0)), \"\")","v":"Kost veel energie"},null,null,{"$f":"IF(B13<>\"\", INDEX('Mooi Werk Excel'!$C$277:$C$288, MATCH(B13, 'Mooi Werk Excel'!$G$277:$G$288, 0)), \"\")","v":"Wil ik minder (−)"},null,{"$f":"IF(B13<>\"\", INDEX('Mooi Werk Excel'!$E$277:$E$288, MATCH(B13, 'Mooi Werk Excel'!$G$277:$G$288, 0)), \"\")","v":"Kan ik slechter (−)"},null,null,{"$f":"IF(B13<>\"\", IF('Mooi Werk Excel'!G326<>\"\", INDEX('Mooi Werk Excel'!$G$323:$G$334, MATCH(B13, 'Mooi Werk Excel'!$E$323:$E$334, 0)), \"\"), \"\")","v":"x"}]
[null,{"$f":"IF('Mooi Werk Excel'!E327<>\"\", 'Mooi Werk Excel'!E327, \"\")","v":"Beeld zoeken"},null,{"$f":"IF('Mooi Werk Excel'!I327<>\"\", ROUND('Mooi Werk Excel'!I327, 0), \"\")","v":15},"%",{"$f":"IF('Mooi Werk Excel'!K327<>\"\", ROUND('Mooi Werk Excel'!K327, 1), \"\")","v":6},"uur",null,{"$f":"IF(B14<>\"\", INDEX('Mooi Werk Excel'!$E$139:$E$150, MATCH(B14, 'Mooi Werk Excel'!$G$139:$G$150, 0)), \"\")","v":"Kerntaak"},null,null,null,{"$f":"IF(B14<>\"\", INDEX('Mooi Werk Excel'!$C$185:$C$196, MATCH(B14, 'Mooi Werk Excel'!$G$185:$G$196, 0)), \"\")","v":"Vanaf begin"},null,{"$f":"IF(B14<>\"\", INDEX('Mooi Werk Excel'!$E$185:$E$196, MATCH(B14, 'Mooi Werk Excel'!$G$185:$G$196, 0)), \"\")","v":"krimptaak"},null,{"$f":"IF(B14<>\"\", INDEX('Mooi Werk Excel'!$AU$231:$AU$242, MATCH(B14, 'Mooi Werk Excel'!$G$231:$G$242, 0)), \"\")","v":"Mooi"},{"$f":"IF(B14<>\"\", INDEX('Mooi Werk Excel'!$C$231:$C$242, MATCH(B14, 'Mooi Werk Excel'!$G$231:$G$242, 0)), \"\")","v":"Geeft veel energie"},null,{"$f":"IF(B14<>\"\", INDEX('Mooi Werk Excel'!$E$231:$E$242, MATCH(B14, 'Mooi Werk Excel'!$G$231:$G$242, 0)), \"\")","v":"Kost weinig energie"},null,null,{"$f":"IF(B14<>\"\", INDEX('Mooi Werk Excel'!$C$277:$C$288, MATCH(B14, 'Mooi Werk Excel'!$G$277:$G$288, 0)), \"\")","v":"Wil ik nog (+)"},null,{"$f":"IF(B14<>\"\", INDEX('Mooi Werk Excel'!$E$277:$E$288, MATCH(B14, 'Mooi Werk Excel'!$G$277:$G$288, 0)), \"\")","v":"Kan ik goed (+)"},null,null,{"$f":"IF(B14<>\"\", IF('Mooi Werk Excel'!G327<>\"\", INDEX('Mooi Werk Excel'!$G$323:$G$334, MATCH(B14, 'Mooi Werk Excel'!$E$323:$E$334, 0)), \"\"), \"\")","v":"x"}]
[null,{"$f":"IF('Mooi Werk Excel'!E328<>\"\", 'Mooi Werk Excel'!E328, \"\")","v":"Website"},null,{"$f":"IF('Mooi Werk Excel'!I328<>\"\", ROUND('Mooi Werk Excel'!I328, 0), \"\")","v":10},"%",{"$f":"IF('Mooi Werk Excel'!K328<>\"\", ROUND('Mooi Werk Excel'!K328, 1), \"\")","v":4},"uur",null,{"$f":"IF(B15<>\"\", INDEX('Mooi Werk Excel'!$E$139:$E$150, MATCH(B15, 'Mooi Werk Excel'!$G$139:$G$150, 0)), \"\")","v":"Extra taak"},null,null,null,{"$f":"IF(B15<>\"\", INDEX('Mooi Werk Excel'!$C$185:$C$196, MATCH(B15, 'Mooi Werk Excel'!$G$185:$G$196, 0)), \"\")","v":"Later erbij"},null,{"$f":"IF(B15<>\"\", INDEX('Mooi Werk Excel'!$E$185:$E$196, MATCH(B15, 'Mooi Werk Excel'!$G$185:$G$196, 0)), \"\")","v":"GROEITAAK"},null,{"$f":"IF(B15<>\"\", INDEX('Mooi Werk Excel'!$AU$231:$AU$242, MATCH(B15, 'Mooi Werk Excel'!$G$231:$G$242, 0)), \"\")","v":"Mooi"},{"$f":"IF(B15<>\"\", INDEX('Mooi Werk Excel'!$C$231:$C$242, MATCH(B15, 'Mooi Werk Excel'!$G$231:$G$242, 0)), \"\")","v":"Geeft veel energie"},null,{"$f":"IF(B15<>\"\", INDEX('Mooi Werk Excel'!$E$231:$E$242, MATCH(B15, 'Mooi Werk Excel'!$G$231:$G$242, 0)), \"\")","v":"Kost weinig energie"},null,null,{"$f":"IF(B15<>\"\", INDEX('Mooi Werk Excel'!$C$277:$C$288, MATCH(B15, 'Mooi Werk Excel'!$G$277:$G$288, 0)), \"\")","v":"Wil ik nog (+)"},null,{"$f":"IF(B15<>\"\", INDEX('Mooi Werk Excel'!$E$277:$E$288, MATCH(B15, 'Mooi Werk Excel'!$G$277:$G$288, 0)), \"\")","v":"Kan ik goed (+)"},null,null,{"$f":"IF(B15<>\"\", IF('Mooi Werk Excel'!G328<>\"\", INDEX('Mooi Werk Excel'!$G$323:$G$334, MATCH(B15, 'Mooi Werk Excel'!$E$323:$E$334, 0)), \"\"), \"\")","v":"x"}]
[null,{"$f":"IF('Mooi Werk Excel'!E329<>\"\", 'Mooi Werk Excel'!E329, \"\")","v":"Nieuws bijhouden"},null,{"$f":"IF('Mooi Werk Excel'!I329<>\"\", ROUND('Mooi Werk Excel'!I329, 0), \"\")","v":5},"%",{"$f":"IF('Mooi Werk Excel'!K329<>\"\", ROUND('Mooi Werk Excel'!K329, 1), \"\")","v":2},"uur",null,{"$f":"IF(B16<>\"\", INDEX('Mooi Werk Excel'!$E$139:$E$150, MATCH(B16, 'Mooi Werk Excel'!$G$139:$G$150, 0)), \"\")","v":"Extra taak"},null,null,null,{"$f":"IF(B16<>\"\", INDEX('Mooi Werk Excel'!$C$185:$C$196, MATCH(B16, 'Mooi Werk Excel'!$G$185:$G$196, 0)), \"\")","v":"Later erbij"},null,{"$f":"IF(B16<>\"\", INDEX('Mooi Werk Excel'!$E$185:$E$196, MATCH(B16, 'Mooi Werk Excel'!$G$185:$G$196, 0)), \"\")","v":"GROEITAAK"},null,{"$f":"IF(B16<>\"\", INDEX('Mooi Werk Excel'!$AU$231:$AU$242, MATCH(B16, 'Mooi Werk Excel'!$G$231:$G$242, 0)), \"\")","v":"2-Faced"},{"$f":"IF(B16<>\"\", INDEX('Mooi Werk Excel'!$C$231:$C$242, MATCH(B16, 'Mooi Werk Excel'!$G$231:$G$242, 0)), \"\")","v":"Geeft veel energie"},null,{"$f":"IF(B16<>\"\", INDEX('Mooi Werk Excel'!$E$231:$E$242, MATCH(B16, 'Mooi Werk Excel'!$G$231:$G$242, 0)), \"\")","v":"Kost veel energie"},null,null,{"$f":"IF(B16<>\"\", INDEX('Mooi Werk Excel'!$C$277:$C$288, MATCH(B16, 'Mooi Werk Excel'!$G$277:$G$288, 0)), \"\")","v":"Wil ik nog (+)"},null,{"$f":"IF(B16<>\"\", INDEX('Mooi Werk Excel'!$E$277:$E$288, MATCH(B16, 'Mooi Werk Excel'!$G$277:$G$288, 0)), \"\")","v":"Kan ik goed (+)"},null,null,{"$f":"IF(B16<>\"\", IF('Mooi Werk Excel'!G329<>\"\", INDEX('Mooi Werk Excel'!$G$323:$G$334, MATCH(B16, 'Mooi Werk Excel'!$E$323:$E$334, 0)), \"\"), \"\")","v":"x"}]
[null,{"$f":"IF('Mooi Werk Excel'!E330<>\"\", 'Mooi Werk Excel'!E330, \"\")","v":"Nieuwsbrief"},null,{"$f":"IF('Mooi Werk Excel'!I330<>\"\", ROUND('Mooi Werk Excel'!I330, 0), \"\")","v":3},"%",{"$f":"IF('Mooi Werk Excel'!K330<>\"\", ROUND('Mooi Werk Excel'!K330, 1), \"\")","v":1.2},"uur",null,{"$f":"IF(B17<>\"\", INDEX('Mooi Werk Excel'!$E$139:$E$150, MATCH(B17, 'Mooi Werk Excel'!$G$139:$G$150, 0)), \"\")","v":"Extra taak"},null,null,null,{"$f":"IF(B17<>\"\", INDEX('Mooi Werk Excel'!$C$185:$C$196, MATCH(B17, 'Mooi Werk Excel'!$G$185:$G$196, 0)), \"\")","v":"Later erbij"},null,{"$f":"IF(B17<>\"\", INDEX('Mooi Werk Excel'!$E$185:$E$196, MATCH(B17, 'Mooi Werk Excel'!$G$185:$G$196, 0)), \"\")","v":"GROEITAAK"},null,{"$f":"IF(B17<>\"\", INDEX('Mooi Werk Excel'!$AU$231:$AU$242, MATCH(B17, 'Mooi Werk Excel'!$G$231:$G$242, 0)), \"\")","v":"Mooi"},{"$f":"IF(B17<>\"\", INDEX('Mooi Werk Excel'!$C$231:$C$242, MATCH(B17, 'Mooi Werk Excel'!$G$231:$G$242, 0)), \"\")","v":"Geeft veel energie"},null,{"$f":"IF(B17<>\"\", INDEX('Mooi Werk Excel'!$E$231:$E$242, MATCH(B17, 'Mooi Werk Excel'!$G$231:$G$242, 0)), \"\")","v":"Kost weinig energie"},null,null,{"$f":"IF(B17<>\"\", INDEX('Mooi Werk Excel'!$C$277:$C$288, MATCH(B17, 'Mooi Werk Excel'!$G$277:$G$288, 0)), \"\")","v":"Wil ik nog (+)"},null,{"$f":"IF(B17<>\"\", INDEX('Mooi Werk Excel'!$E$277:$E$288, MATCH(B17, 'Mooi Werk Excel'!$G$277:$G$288, 0)), \"\")","v":"Kan ik goed (+)"},null,null,{"$f":"IF(B17<>\"\", IF('Mooi Werk Excel'!G330<>\"\", INDEX('Mooi Werk Excel'!$G$323:$G$334, MATCH(B17, 'Mooi Werk Excel'!$E$323:$E$334, 0)), \"\"), \"\")","v":"x"}]
[null,{"$f":"IF('Mooi Werk Excel'!E331<>\"\", 'Mooi Werk Excel'!E331, \"\")","v":"Research"},null,{"$f":"IF('Mooi Werk Excel'!I331<>\"\", ROUND('Mooi Werk Excel'!I331, 0), \"\")","v":3},"%",{"$f":"IF('Mooi Werk Excel'!K331<>\"\", ROUND('Mooi Werk Excel'!K331, 1), \"\")","v":1.2},"uur",null,{"$f":"IF(B18<>\"\", INDEX('Mooi Werk Excel'!$E$139:$E$150, MATCH(B18, 'Mooi Werk Excel'!$G$139:$G$150, 0)), \"\")","v":"Kerntaak"},null,null,null,{"$f":"IF(B18<>\"\", INDEX('Mooi Werk Excel'!$C$185:$C$196, MATCH(B18, 'Mooi Werk Excel'!$G$185:$G$196, 0)), \"\")","v":"Vanaf begin"},null,{"$f":"IF(B18<>\"\", INDEX('Mooi Werk Excel'!$E$185:$E$196, MATCH(B18, 'Mooi Werk Excel'!$G$185:$G$196, 0)), \"\")","v":"GROEITAAK"},null,{"$f":"IF(B18<>\"\", INDEX('Mooi Werk Excel'!$AU$231:$AU$242, MATCH(B18, 'Mooi Werk Excel'!$G$231:$G$242, 0)), \"\")","v":"2-Faced"},{"$f":"IF(B18<>\"\", INDEX('Mooi Werk Excel'!$C$231:$C$242, MATCH(B18, 'Mooi Werk Excel'!$G$231:$G$242, 0)), \"\")","v":"Geeft veel energie"},null,{"$f":"IF(B18<>\"\", INDEX('Mooi Werk Excel'!$E$231:$E$242, MATCH(B18, 'Mooi Werk Excel'!$G$231:$G$242, 0)), \"\")","v":"Kost veel energie"},null,null,{"$f":"IF(B18<>\"\", INDEX('Mooi Werk Excel'!$C$277:$C$288, MATCH(B18, 'Mooi Werk Excel'!$G$277:$G$288, 0)), \"\")","v":"Wil ik minder (−)"},null,{"$f":"IF(B18<>\"\", INDEX('Mooi Werk Excel'!$E$277:$E$288, MATCH(B18, 'Mooi Werk Excel'!$G$277:$G$288, 0)), \"\")","v":"Kan ik goed (+)"},null,null,{"$f":"IF(B18<>\"\", IF('Mooi Werk Excel'!G331<>\"\", INDEX('Mooi Werk Excel'!$G$323:$G$334, MATCH(B18, 'Mooi Werk Excel'!$E$323:$E$334, 0)), \"\"), \"\")","v":"x"}]
[null,{"$f":"IF('Mooi Werk Excel'!E332<>\"\", 'Mooi Werk Excel'!E332, \"\")","v":"Andere bladen"},null,{"$f":"IF('Mooi Werk Excel'!I332<>\"\", ROUND('Mooi Werk Excel'!I332, 0), \"\")","v":3},"%",{"$f":"IF('Mooi Werk Excel'!K332<>\"\", ROUND('Mooi Werk Excel'!K332, 1), \"\")","v":1.2},"uur",null,{"$f":"IF(B19<>\"\", INDEX('Mooi Werk Excel'!$E$139:$E$150, MATCH(B19, 'Mooi Werk Excel'!$G$139:$G$150, 0)), \"\")","v":"Niet-Kerntaak"},null,null,null,{"$f":"IF(B19<>\"\", INDEX('Mooi Werk Excel'!$C$185:$C$196, MATCH(B19, 'Mooi Werk Excel'!$G$185:$G$196, 0)), \"\")","v":"Later erbij"},null,{"$f":"IF(B19<>\"\", INDEX('Mooi Werk Excel'!$E$185:$E$196, MATCH(B19, 'Mooi Werk Excel'!$G$185:$G$196, 0)), \"\")","v":"krimptaak"},null,{"$f":"IF(B19<>\"\", INDEX('Mooi Werk Excel'!$AU$231:$AU$242, MATCH(B19, 'Mooi Werk Excel'!$G$231:$G$242, 0)), \"\")","v":"Leeg"},{"$f":"IF(B19<>\"\", INDEX('Mooi Werk Excel'!$C$231:$C$242, MATCH(B19, 'Mooi Werk Excel'!$G$231:$G$242, 0)), \"\")","v":"Geeft weinig energie"},null,{"$f":"IF(B19<>\"\", INDEX('Mooi Werk Excel'!$E$231:$E$242, MATCH(B19, 'Mooi Werk Excel'!$G$231:$G$242, 0)), \"\")","v":"Kost weinig energie"},null,null,{"$f":"IF(B19<>\"\", INDEX('Mooi Werk Excel'!$C$277:$C$288, MATCH(B19, 'Mooi Werk Excel'!$G$277:$G$288, 0)), \"\")","v":"Wil ik nog (+)"},null,{"$f":"IF(B19<>\"\", INDEX('Mooi Werk Excel'!$E$277:$E$288, MATCH(B19, 'Mooi Werk Excel'!$G$277:$G$288, 0)), \"\")","v":"Kan ik goed (+)"},null,null,{"$f":"IF(B19<>\"\", IF('Mooi Werk Excel'!G332<>\"\", INDEX('Mooi Werk Excel'!$G$323:$G$334, MATCH(B19, 'Mooi Werk Excel'!$E$323:$E$334, 0)), \"\"), \"\")","v":"x"}]
[null,{"$f":"IF('Mooi Werk Excel'!E333<>\"\", 'Mooi Werk Excel'!E333, \"\")","v":"Telefoon"},null,{"$f":"IF('Mooi Werk Excel'!I333<>\"\", ROUND('Mooi Werk Excel'!I333, 0), \"\")","v":3},"%",{"$f":"IF('Mooi Werk Excel'!K333<>\"\", ROUND('Mooi Werk Excel'!K333, 1), \"\")","v":1.2},"uur",null,{"$f":"IF(B20<>\"\", INDEX('Mooi Werk Excel'!$E$139:$E$150, MATCH(B20, 'Mooi Werk Excel'!$G$139:$G$150, 0)), \"\")","v":"Niet-Kerntaak"},null,null,null,{"$f":"IF(B20<>\"\", INDEX('Mooi Werk Excel'!$C$185:$C$196, MATCH(B20, 'Mooi Werk Excel'!$G$185:$G$196, 0)), \"\")","v":"Vanaf begin"},null,{"$f":"IF(B20<>\"\", INDEX('Mooi Werk Excel'!$E$185:$E$196, MATCH(B20, 'Mooi Werk Excel'!$G$185:$G$196, 0)), \"\")","v":"GROEITAAK"},null,{"$f":"IF(B20<>\"\", INDEX('Mooi Werk Excel'!$AU$231:$AU$242, MATCH(B20, 'Mooi Werk Excel'!$G$231:$G$242, 0)), \"\")","v":"Leeg"},{"$f":"IF(B20<>\"\", INDEX('Mooi Werk Excel'!$C$231:$C$242, MATCH(B20, 'Mooi Werk Excel'!$G$231:$G$242, 0)), \"\")","v":"Geeft weinig energie"},null,{"$f":"IF(B20<>\"\", INDEX('Mooi Werk Excel'!$E$231:$E$242, MATCH(B20, 'Mooi Werk Excel'!$G$231:$G$242, 0)), \"\")","v":"Kost weinig energie"},null,null,{"$f":"IF(B20<>\"\", INDEX('Mooi Werk Excel'!$C$277:$C$288, MATCH(B20, 'Mooi Werk Excel'!$G$277:$G$288, 0)), \"\")","v":"Wil ik minder (−)"},null,{"$f":"IF(B20<>\"\", INDEX('Mooi Werk Excel'!$E$277:$E$288, MATCH(B20, 'Mooi Werk Excel'!$G$277:$G$288, 0)), \"\")","v":"Kan ik slechter (−)"},null,null,{"$f":"IF(B20<>\"\", IF('Mooi Werk Excel'!G333<>\"\", INDEX('Mooi Werk Excel'!$G$323:$G$334, MATCH(B20, 'Mooi Werk Excel'!$E$323:$E$334, 0)), \"\"), \"\")","v":"x"}]
{"$rows_left_out":10}
{"sheet":"Dropdown","index":3,"n_rows":11,"n_cols":14,"rows_kept":11,"cut":false,"hidden":true,"merged":[]}
[3,"Extra taak","Later erbij","GROEITAAK","Wil ik minder (−)","Kan ik goed (+)","Kost veel energie","Geeft veel energie","Geen sleutelwens","Anders","Werkmodus=0","Licentiecode","‘Teller’","Zoom"]
[5,"Kerntaak","Vanaf begin","krimptaak","Wil ik nog (+)","Kan ik slechter (−)","Kost weinig energie","Geeft weinig energie","Sleutelwens","Groter","Presentatiemodus=1","N.v.t.",0,75]
[10,"Niet-Kerntaak",null,null,null,null,null,null,null,"Kleiner",0,null,null,{"$f":"IF(N2=75, \"75%, zoom in naar 110%\", IF(N2=110, \"110%, zoom in naar 130%\", \"130%, zoom out naar 75%\"))","v":"75%, zoom in naar 110%"}]
[15,null,null,null,null,null,null,null,null,"Upskilling",{"$f":"\"Deze demoversie kan na deze ‘sessie’ nog \" & 25-M2 & \" keer worden gebruikt.\"","v":"Deze demoversie kan na deze ‘sessie’ nog 25 keer worden gebruikt."}]
[20,null,null,null,null,null,null,null,null,"x"]
[25]
[30]
[35]
[40]
[45]
[50]